Update BUILD RESULTS THREAD

Status
Not open for further replies.

NASSP BuildBot

New member
Joined
May 27, 2018
Messages
113
Reaction score
0
Points
0
Location
Dallas
Website
www.lunar-tokyo.net
BRANCH Orbiter2016 BUILD 1484 FAILED

BRANCH: Orbiter2016
BUILD NUMBER: 1484
COMMIT: [email protected] [7220041a8c] Merge pull request #515 from indy91/Orbiter2016
BUILD STATUS: FAILED
BUILD START: 4/11/2020 12:25 PM
BUILD ENDED: 4/11/2020 12:32 PM
BUILD DURATION: 00:07:24.3467502
JOB: 6ar485hxuqgoswj8
MESSAGES:

Crawler: orbitersdk\samples\projectapollo\src_sys\toggleswitch.h(1630): error C2039: 'vector': is not a member of 'std'
Crawler: orbitersdk\samples\projectapollo\src_sys\toggleswitch.h(1630): error C2143: syntax error: missing ';' before '<'
Crawler: orbitersdk\samples\projectapollo\src_sys\toggleswitch.h(1630): error C4430: missing type specifier - int assumed. Note: C++ does not support default-int
Crawler: orbitersdk\samples\projectapollo\src_sys\toggleswitch.h(1630): error C2238: unexpected token(s) preceding ';'
LRV: orbitersdk\samples\projectapollo\src_sys\toggleswitch.h(1630): error C2039: 'vector': is not a member of 'std'
LRV: orbitersdk\samples\projectapollo\src_sys\toggleswitch.h(1630): error C2143: syntax error: missing ';' before '<'
LRV: orbitersdk\samples\projectapollo\src_sys\toggleswitch.h(1630): error C4430: missing type specifier - int assumed. Note: C++ does not support default-int
LRV: orbitersdk\samples\projectapollo\src_sys\toggleswitch.h(1630): error C2238: unexpected token(s) preceding ';'
ML: orbitersdk\samples\projectapollo\src_sys\toggleswitch.h(1630): error C2039: 'vector': is not a member of 'std'
ML: orbitersdk\samples\projectapollo\src_sys\toggleswitch.h(1630): error C2143: syntax error: missing ';' before '<'
ML: orbitersdk\samples\projectapollo\src_sys\toggleswitch.h(1630): error C4430: missing type specifier - int assumed. Note: C++ does not support default-int
ML: orbitersdk\samples\projectapollo\src_sys\toggleswitch.h(1630): error C2238: unexpected token(s) preceding ';'
ML: orbitersdk\samples\projectapollo\src_launch\rca110a.cpp(56): error C2039: 'vector': is not a member of 'std'
ML: orbitersdk\samples\projectapollo\src_launch\rca110a.cpp(56): error C2065: 'vector': undeclared identifier
ML: orbitersdk\samples\projectapollo\src_launch\rca110a.cpp(56): error C2275: 'std::string': illegal use of this type as an expression
ML: orbitersdk\samples\projectapollo\src_launch\rca110a.cpp(56): error C2065: 'seq': undeclared identifier
ML: orbitersdk\samples\projectapollo\src_launch\rca110a.cpp(62): error C2065: 'seq': undeclared identifier
ML: orbitersdk\samples\projectapollo\src_launch\rca110a.cpp(69): error C2065: 'seq': undeclared identifier
ML: orbitersdk\samples\projectapollo\src_launch\rca110a.cpp(76): error C2065: 'seq': undeclared identifier
ML: orbitersdk\samples\projectapollo\src_launch\rca110a.cpp(78): error C2065: 'seq': undeclared identifier
ML: orbitersdk\samples\projectapollo\src_launch\rca110a.cpp(80): error C2065: 'seq': undeclared identifier
ML: orbitersdk\samples\projectapollo\src_launch\rca110a.cpp(84): error C2065: 'seq': undeclared identifier
ML: orbitersdk\samples\projectapollo\src_launch\rca110a.cpp(85): error C2065: 'seq': undeclared identifier
ML: orbitersdk\samples\projectapollo\src_launch\rca110a.cpp(86): error C2065: 'seq': undeclared identifier
ML: orbitersdk\samples\projectapollo\src_launch\rca110a.cpp(87): error C2065: 'seq': undeclared identifier
ML: orbitersdk\samples\projectapollo\src_launch\rca110a.cpp(88): error C2065: 'seq': undeclared identifier
ML: orbitersdk\samples\projectapollo\src_launch\rca110a.cpp(89): error C2065: 'seq': undeclared identifier
ML: orbitersdk\samples\projectapollo\src_launch\rca110a.cpp(90): error C2065: 'seq': undeclared identifier
ML: orbitersdk\samples\projectapollo\src_launch\rca110a.cpp(91): error C2065: 'seq': undeclared identifier
ML: orbitersdk\samples\projectapollo\src_launch\rca110a.cpp(92): error C2065: 'seq': undeclared identifier
ML: orbitersdk\samples\projectapollo\src_launch\rca110a.cpp(93): error C2065: 'seq': undeclared identifier
MSS: orbitersdk\samples\projectapollo\src_sys\toggleswitch.h(1630): error C2039: 'vector': is not a member of 'std'
MSS: orbitersdk\samples\projectapollo\src_sys\toggleswitch.h(1630): error C2143: syntax error: missing ';' before '<'
MSS: orbitersdk\samples\projectapollo\src_sys\toggleswitch.h(1630): error C4430: missing type specifier - int assumed. Note: C++ does not support default-int
MSS: orbitersdk\samples\projectapollo\src_sys\toggleswitch.h(1630): error C2238: unexpected token(s) preceding ';'
SIVb: orbitersdk\samples\projectapollo\src_sys\toggleswitch.h(1630): error C2039: 'vector': is not a member of 'std'
SIVb: orbitersdk\samples\projectapollo\src_sys\toggleswitch.h(1630): error C2143: syntax error: missing ';' before '<'
SIVb: orbitersdk\samples\projectapollo\src_sys\toggleswitch.h(1630): error C4430: missing type specifier - int assumed. Note: C++ does not support default-int
SIVb: orbitersdk\samples\projectapollo\src_sys\toggleswitch.h(1630): error C2238: unexpected token(s) preceding ';'
SIVb: orbitersdk\samples\projectapollo\src_sys\toggleswitch.h(1630): error C2039: 'vector': is not a member of 'std'
SIVb: orbitersdk\samples\projectapollo\src_sys\toggleswitch.h(1630): error C2143: syntax error: missing ';' before '<'
SIVb: orbitersdk\samples\projectapollo\src_sys\toggleswitch.h(1630): error C4430: missing type specifier - int assumed. Note: C++ does not support default-int
SIVb: orbitersdk\samples\projectapollo\src_sys\toggleswitch.h(1630): error C2238: unexpected token(s) preceding ';'
Saturn1b: orbitersdk\samples\projectapollo\src_sys\toggleswitch.h(1630): error C2039: 'vector': is not a member of 'std'
Saturn1b: orbitersdk\samples\projectapollo\src_sys\toggleswitch.h(1630): error C2143: syntax error: missing ';' before '<'
Saturn1b: orbitersdk\samples\projectapollo\src_sys\toggleswitch.h(1630): error C4430: missing type specifier - int assumed. Note: C++ does not support default-int
Saturn1b: orbitersdk\samples\projectapollo\src_sys\toggleswitch.h(1630): error C2238: unexpected token(s) preceding ';'
Saturn1b: orbitersdk\samples\projectapollo\src_sys\toggleswitch.h(1630): error C2039: 'vector': is not a member of 'std'
Saturn1b: orbitersdk\samples\projectapollo\src_sys\toggleswitch.h(1630): error C2143: syntax error: missing ';' before '<'
Saturn1b: orbitersdk\samples\projectapollo\src_sys\toggleswitch.h(1630): error C4430: missing type specifier - int assumed. Note: C++ does not support default-int
Saturn1b: orbitersdk\samples\projectapollo\src_sys\toggleswitch.h(1630): error C2238: unexpected token(s) preceding ';'
Saturn1b: orbitersdk\samples\projectapollo\src_sys\toggleswitch.h(1630): error C2039: 'vector': is not a member of 'std'
Saturn1b: orbitersdk\samples\projectapollo\src_sys\toggleswitch.h(1630): error C2143: syntax error: missing ';' before '<'
Saturn1b: orbitersdk\samples\projectapollo\src_sys\toggleswitch.h(1630): error C4430: missing type specifier - int assumed. Note: C++ does not support default-int
Saturn1b: orbitersdk\samples\projectapollo\src_sys\toggleswitch.h(1630): error C2238: unexpected token(s) preceding ';'
Saturn1b: orbitersdk\samples\projectapollo\src_sys\toggleswitch.h(1630): error C2039: 'vector': is not a member of 'std'
Saturn1b: orbitersdk\samples\projectapollo\src_sys\toggleswitch.h(1630): error C2143: syntax error: missing ';' before '<'
Saturn1b: orbitersdk\samples\projectapollo\src_sys\toggleswitch.h(1630): error C4430: missing type specifier - int assumed. Note: C++ does not support default-int
Saturn1b: orbitersdk\samples\projectapollo\src_sys\toggleswitch.h(1630): error C2238: unexpected token(s) preceding ';'
Saturn1b: orbitersdk\samples\projectapollo\src_sys\toggleswitch.h(1630): error C2039: 'vector': is not a member of 'std'
Saturn1b: orbitersdk\samples\projectapollo\src_sys\toggleswitch.h(1630): error C2143: syntax error: missing ';' before '<'
Saturn1b: orbitersdk\samples\projectapollo\src_sys\toggleswitch.h(1630): error C4430: missing type specifier - int assumed. Note: C++ does not support default-int
Saturn1b: orbitersdk\samples\projectapollo\src_sys\toggleswitch.h(1630): error C2238: unexpected token(s) preceding ';'
Saturn1b: orbitersdk\samples\projectapollo\src_sys\toggleswitch.h(1630): error C2039: 'vector': is not a member of 'std'
Saturn1b: orbitersdk\samples\projectapollo\src_sys\toggleswitch.h(1630): error C2143: syntax error: missing ';' before '<'
Saturn1b: orbitersdk\samples\projectapollo\src_sys\toggleswitch.h(1630): error C4430: missing type specifier - int assumed. Note: C++ does not support default-int
Saturn1b: orbitersdk\samples\projectapollo\src_sys\toggleswitch.h(1630): error C2238: unexpected token(s) preceding ';'
Saturn1b: orbitersdk\samples\projectapollo\src_sys\toggleswitch.h(1630): error C2039: 'vector': is not a member of 'std'
Saturn1b: orbitersdk\samples\projectapollo\src_sys\toggleswitch.h(1630): error C2143: syntax error: missing ';' before '<'
Saturn1b: orbitersdk\samples\projectapollo\src_sys\toggleswitch.h(1630): error C4430: missing type specifier - int assumed. Note: C++ does not support default-int
Saturn1b: orbitersdk\samples\projectapollo\src_sys\toggleswitch.h(1630): error C2238: unexpected token(s) preceding ';'
Saturn1b: orbitersdk\samples\projectapollo\src_sys\toggleswitch.h(1630): error C2039: 'vector': is not a member of 'std'
Saturn1b: orbitersdk\samples\projectapollo\src_sys\toggleswitch.h(1630): error C2143: syntax error: missing ';' before '<'
Saturn1b: orbitersdk\samples\projectapollo\src_sys\toggleswitch.h(1630): error C4430: missing type specifier - int assumed. Note: C++ does not support default-int
Saturn1b: orbitersdk\samples\projectapollo\src_sys\toggleswitch.h(1630): error C2238: unexpected token(s) preceding ';'
Saturn1b: orbitersdk\samples\projectapollo\src_sys\toggleswitch.h(1630): error C2039: 'vector': is not a member of 'std'
Saturn1b: orbitersdk\samples\projectapollo\src_sys\toggleswitch.h(1630): error C2143: syntax error: missing ';' before '<'
Saturn1b: orbitersdk\samples\projectapollo\src_sys\toggleswitch.h(1630): error C4430: missing type specifier - int assumed. Note: C++ does not support default-int
Saturn1b: orbitersdk\samples\projectapollo\src_sys\toggleswitch.h(1630): error C2238: unexpected token(s) preceding ';'
Saturn1b: orbitersdk\samples\projectapollo\src_sys\toggleswitch.h(1630): error C2039: 'vector': is not a member of 'std'
Saturn1b: orbitersdk\samples\projectapollo\src_sys\toggleswitch.h(1630): error C2143: syntax error: missing ';' before '<'
Saturn1b: orbitersdk\samples\projectapollo\src_sys\toggleswitch.h(1630): error C4430: missing type specifier - int assumed. Note: C++ does not support default-int
Saturn1b: orbitersdk\samples\projectapollo\src_sys\toggleswitch.h(1630): error C2238: unexpected token(s) preceding ';'
Saturn1b: orbitersdk\samples\projectapollo\src_sys\toggleswitch.h(1630): error C2039: 'vector': is not a member of 'std'
Saturn1b: orbitersdk\samples\projectapollo\src_sys\toggleswitch.h(1630): error C2143: syntax error: missing ';' before '<'
Saturn1b: orbitersdk\samples\projectapollo\src_sys\toggleswitch.h(1630): error C4430: missing type specifier - int assumed. Note: C++ does not support default-int
Saturn1b: orbitersdk\samples\projectapollo\src_sys\toggleswitch.h(1630): error C2238: unexpected token(s) preceding ';'
Saturn1b: orbitersdk\samples\projectapollo\src_sys\toggleswitch.h(1630): error C2039: 'vector': is not a member of 'std'
Saturn1b: orbitersdk\samples\projectapollo\src_sys\toggleswitch.h(1630): error C2143: syntax error: missing ';' before '<'
Saturn1b: orbitersdk\samples\projectapollo\src_sys\toggleswitch.h(1630): error C4430: missing type specifier - int assumed. Note: C++ does not support default-int
Saturn1b: orbitersdk\samples\projectapollo\src_sys\toggleswitch.h(1630): error C2238: unexpected token(s) preceding ';'
Saturn1b: orbitersdk\samples\projectapollo\src_sys\toggleswitch.h(1630): error C2039: 'vector': is not a member of 'std'
Saturn1b: orbitersdk\samples\projectapollo\src_sys\toggleswitch.h(1630): error C2143: syntax error: missing ';' before '<'
Saturn1b: orbitersdk\samples\projectapollo\src_sys\toggleswitch.h(1630): error C4430: missing type specifier - int assumed. Note: C++ does not support default-int
Saturn1b: orbitersdk\samples\projectapollo\src_sys\toggleswitch.h(1630): error C2238: unexpected token(s) preceding ';'
Saturn1b: orbitersdk\samples\projectapollo\src_sys\toggleswitch.h(1630): error C2039: 'vector': is not a member of 'std'
Saturn1b: orbitersdk\samples\projectapollo\src_sys\toggleswitch.h(1630): error C2143: syntax error: missing ';' before '<'
Saturn1b: orbitersdk\samples\projectapollo\src_sys\toggleswitch.h(1630): error C4430: missing type specifier - int assumed. Note: C++ does not support default-int
Saturn1b: orbitersdk\samples\projectapollo\src_sys\toggleswitch.h(1630): error C2238: unexpected token(s) preceding ';'
Saturn1b: orbitersdk\samples\projectapollo\src_sys\toggleswitch.h(1630): error C2039: 'vector': is not a member of 'std'
Saturn1b: orbitersdk\samples\projectapollo\src_sys\toggleswitch.h(1630): error C2143: syntax error: missing ';' before '<'
Saturn1b: orbitersdk\samples\projectapollo\src_sys\toggleswitch.h(1630): error C4430: missing type specifier - int assumed. Note: C++ does not support default-int
Saturn1b: orbitersdk\samples\projectapollo\src_sys\toggleswitch.h(1630): error C2238: unexpected token(s) preceding ';'
Saturn1b: orbitersdk\samples\projectapollo\src_sys\toggleswitch.h(1630): error C2039: 'vector': is not a member of 'std'
Saturn1b: orbitersdk\samples\projectapollo\src_sys\toggleswitch.h(1630): error C2143: syntax error: missing ';' before '<'
Saturn1b: orbitersdk\samples\projectapollo\src_sys\toggleswitch.h(1630): error C4430: missing type specifier - int assumed. Note: C++ does not support default-int
Saturn1b: orbitersdk\samples\projectapollo\src_sys\toggleswitch.h(1630): error C2238: unexpected token(s) preceding ';'
Saturn1b: orbitersdk\samples\projectapollo\src_sys\toggleswitch.h(1630): error C2039: 'vector': is not a member of 'std'
Saturn1b: orbitersdk\samples\projectapollo\src_sys\toggleswitch.h(1630): error C2143: syntax error: missing ';' before '<'
Saturn1b: orbitersdk\samples\projectapollo\src_sys\toggleswitch.h(1630): error C4430: missing type specifier - int assumed. Note: C++ does not support default-int
Saturn1b: orbitersdk\samples\projectapollo\src_sys\toggleswitch.h(1630): error C2238: unexpected token(s) preceding ';'
Saturn1b: orbitersdk\samples\projectapollo\src_sys\toggleswitch.h(1630): error C2039: 'vector': is not a member of 'std'
Saturn1b: orbitersdk\samples\projectapollo\src_sys\toggleswitch.h(1630): error C2143: syntax error: missing ';' before '<'
Saturn1b: orbitersdk\samples\projectapollo\src_sys\toggleswitch.h(1630): error C4430: missing type specifier - int assumed. Note: C++ does not support default-int
Saturn1b: orbitersdk\samples\projectapollo\src_sys\toggleswitch.h(1630): error C2238: unexpected token(s) preceding ';'
Saturn1b: orbitersdk\samples\projectapollo\src_sys\toggleswitch.h(1630): error C2039: 'vector': is not a member of 'std'


-- Too many messages, post truncated --

---------- Post added at 12:52 PM ---------- Previous post was at 12:32 PM ----------

BRANCH: Orbiter2016
BUILD NUMBER: 1485
COMMIT: [email protected] [d04d03fca1] Attempt to fix build errors #1
BUILD STATUS: FAILED
BUILD START: 4/11/2020 12:43 PM
BUILD ENDED: 4/11/2020 12:52 PM
BUILD DURATION: 00:08:52.3400831
JOB: 27ptn9mgop88xjb6
MESSAGES:

ML: orbitersdk\samples\projectapollo\src_launch\rca110a.cpp(178): warning C4996: 'sscanf': This function or variable may be unsafe. Consider using sscanf_s instead. To disable deprecation, use _CRT_SECURE_NO_WARNINGS. See online help for details.
ML: orbitersdk\samples\projectapollo\src_launch\rca110a.cpp(218): warning C4996: 'sscanf': This function or variable may be unsafe. Consider using sscanf_s instead. To disable deprecation, use _CRT_SECURE_NO_WARNINGS. See online help for details.
LC34: orbitersdk\samples\projectapollo\src_launch\rca110a.cpp(178): warning C4996: 'sscanf': This function or variable may be unsafe. Consider using sscanf_s instead. To disable deprecation, use _CRT_SECURE_NO_WARNINGS. See online help for details.
LC34: orbitersdk\samples\projectapollo\src_launch\rca110a.cpp(218): warning C4996: 'sscanf': This function or variable may be unsafe. Consider using sscanf_s instead. To disable deprecation, use _CRT_SECURE_NO_WARNINGS. See online help for details.
ApolloRTCCMFD: orbitersdk\samples\projectapollo\src_rtccmfd\rtcctables.h(60): error C2039: 'vector': is not a member of 'std'
ApolloRTCCMFD: orbitersdk\samples\projectapollo\src_rtccmfd\rtcctables.h(60): error C2143: syntax error: missing ';' before '<'
ApolloRTCCMFD: orbitersdk\samples\projectapollo\src_rtccmfd\rtcctables.h(60): error C4430: missing type specifier - int assumed. Note: C++ does not support default-int
ApolloRTCCMFD: orbitersdk\samples\projectapollo\src_rtccmfd\rtcctables.h(60): error C2238: unexpected token(s) preceding ';'
ApolloRTCCMFD: orbitersdk\samples\projectapollo\src_rtccmfd\csmlmguidancesim.h(97): error C2039: 'vector': is not a member of 'std'
ApolloRTCCMFD: orbitersdk\samples\projectapollo\src_rtccmfd\csmlmguidancesim.h(97): error C2061: syntax error: identifier 'vector'
ApolloRTCCMFD: orbitersdk\samples\projectapollo\src_rtccmfd\csmlmguidancesim.h(261): error C2039: 'vector': is not a member of 'std'
ApolloRTCCMFD: orbitersdk\samples\projectapollo\src_rtccmfd\csmlmguidancesim.h(261): error C2143: syntax error: missing ';' before '<'
ApolloRTCCMFD: orbitersdk\samples\projectapollo\src_rtccmfd\csmlmguidancesim.h(261): error C4430: missing type specifier - int assumed. Note: C++ does not support default-int
ApolloRTCCMFD: orbitersdk\samples\projectapollo\src_rtccmfd\csmlmguidancesim.h(261): error C2238: unexpected token(s) preceding ';'
ApolloRTCCMFD: orbitersdk\samples\projectapollo\src_rtccmfd\csmlmguidancesim.cpp(99): error C2065: 'WeightTable': undeclared identifier
ApolloRTCCMFD: orbitersdk\samples\projectapollo\src_rtccmfd\csmlmguidancesim.cpp(268): error C2065: 'WeightTable': undeclared identifier
ApolloRTCCMFD: orbitersdk\samples\projectapollo\src_rtccmfd\csmlmguidancesim.cpp(424): error C2065: 'WeightTable': undeclared identifier
ApolloRTCCMFD: orbitersdk\samples\projectapollo\src_rtccmfd\csmlmguidancesim.cpp(488): error C2039: 'table': is not a member of 'EphemerisDataTable'
ApolloRTCCMFD: orbitersdk\samples\projectapollo\src_rtccmfd\csmlmguidancesim.cpp(813): error C2511: 'void CSMLMPoweredFlightIntegration::pCRUNG(EphemerisDataTable *,std::vector<double,std::allocator<_Ty>> &)': overloaded member function not found in 'CSMLMPoweredFlightIntegration'
ApolloRTCCMFD: orbitersdk\samples\projectapollo\src_rtccmfd\csmlmguidancesim.cpp(815): error C2597: illegal reference to non-static member 'CSMLMPoweredFlightIntegration::DT'
ApolloRTCCMFD: orbitersdk\samples\projectapollo\src_rtccmfd\csmlmguidancesim.cpp(815): error C3867: 'CSMLMPoweredFlightIntegration::DT': non-standard syntax; use '&' to create a pointer to member
ApolloRTCCMFD: orbitersdk\samples\projectapollo\src_rtccmfd\csmlmguidancesim.cpp(815): error C2597: illegal reference to non-static member 'CSMLMPoweredFlightIntegration::DTPREV'
ApolloRTCCMFD: orbitersdk\samples\projectapollo\src_rtccmfd\csmlmguidancesim.cpp(815): error C3867: 'CSMLMPoweredFlightIntegration::DTPREV': non-standard syntax; use '&' to create a pointer to member
ApolloRTCCMFD: orbitersdk\samples\projectapollo\src_rtccmfd\csmlmguidancesim.cpp(815): error C2568: '!=': unable to resolve function overload
ApolloRTCCMFD: orbitersdk\samples\projectapollo\src_rtccmfd\csmlmguidancesim.cpp(817): error C2597: illegal reference to non-static member 'CSMLMPoweredFlightIntegration::DT'
ApolloRTCCMFD: orbitersdk\samples\projectapollo\src_rtccmfd\csmlmguidancesim.cpp(817): error C3867: 'CSMLMPoweredFlightIntegration::DT': non-standard syntax; use '&' to create a pointer to member
ApolloRTCCMFD: orbitersdk\samples\projectapollo\src_rtccmfd\csmlmguidancesim.cpp(817): error C2597: illegal reference to non-static member 'CSMLMPoweredFlightIntegration::DT2'
ApolloRTCCMFD: orbitersdk\samples\projectapollo\src_rtccmfd\csmlmguidancesim.cpp(818): error C2597: illegal reference to non-static member 'CSMLMPoweredFlightIntegration::DT'
ApolloRTCCMFD: orbitersdk\samples\projectapollo\src_rtccmfd\csmlmguidancesim.cpp(818): error C3867: 'CSMLMPoweredFlightIntegration::DT': non-standard syntax; use '&' to create a pointer to member
ApolloRTCCMFD: orbitersdk\samples\projectapollo\src_rtccmfd\csmlmguidancesim.cpp(818): error C2597: illegal reference to non-static member 'CSMLMPoweredFlightIntegration::DT4'
ApolloRTCCMFD: orbitersdk\samples\projectapollo\src_rtccmfd\csmlmguidancesim.cpp(819): error C2597: illegal reference to non-static member 'CSMLMPoweredFlightIntegration::DT'
ApolloRTCCMFD: orbitersdk\samples\projectapollo\src_rtccmfd\csmlmguidancesim.cpp(819): error C3867: 'CSMLMPoweredFlightIntegration::DT': non-standard syntax; use '&' to create a pointer to member
ApolloRTCCMFD: orbitersdk\samples\projectapollo\src_rtccmfd\csmlmguidancesim.cpp(819): error C2597: illegal reference to non-static member 'CSMLMPoweredFlightIntegration::DT6'
ApolloRTCCMFD: orbitersdk\samples\projectapollo\src_rtccmfd\csmlmguidancesim.cpp(820): error C2597: illegal reference to non-static member 'CSMLMPoweredFlightIntegration::DTPREV'
ApolloRTCCMFD: orbitersdk\samples\projectapollo\src_rtccmfd\csmlmguidancesim.cpp(823): error C2597: illegal reference to non-static member 'CSMLMPoweredFlightIntegration::KCODE'
ApolloRTCCMFD: orbitersdk\samples\projectapollo\src_rtccmfd\csmlmguidancesim.cpp(824): error C2352: 'CSMLMPoweredFlightIntegration::pCRDD': illegal call of non-static member function
ApolloRTCCMFD: orbitersdk\samples\projectapollo\src_rtccmfd\csmlmguidancesim.cpp(825): error C2597: illegal reference to non-static member 'CSMLMPoweredFlightIntegration::KGN'
ApolloRTCCMFD: orbitersdk\samples\projectapollo\src_rtccmfd\csmlmguidancesim.cpp(825): error C3867: 'CSMLMPoweredFlightIntegration::KGN': non-standard syntax; use '&' to create a pointer to member
ApolloRTCCMFD: orbitersdk\samples\projectapollo\src_rtccmfd\csmlmguidancesim.cpp(830): error C2597: illegal reference to non-static member 'CSMLMPoweredFlightIntegration::T'
ApolloRTCCMFD: orbitersdk\samples\projectapollo\src_rtccmfd\csmlmguidancesim.cpp(830): error C3867: 'CSMLMPoweredFlightIntegration::T': non-standard syntax; use '&' to create a pointer to member
ApolloRTCCMFD: orbitersdk\samples\projectapollo\src_rtccmfd\csmlmguidancesim.cpp(830): error C2597: illegal reference to non-static member 'CSMLMPoweredFlightIntegration::TBI'
ApolloRTCCMFD: orbitersdk\samples\projectapollo\src_rtccmfd\csmlmguidancesim.cpp(830): error C3867: 'CSMLMPoweredFlightIntegration::TBI': non-standard syntax; use '&' to create a pointer to member
ApolloRTCCMFD: orbitersdk\samples\projectapollo\src_rtccmfd\csmlmguidancesim.cpp(830): error C2568: '==': unable to resolve function overload
ApolloRTCCMFD: orbitersdk\samples\projectapollo\src_rtccmfd\csmlmguidancesim.cpp(832): error C2597: illegal reference to non-static member 'CSMLMPoweredFlightIntegration::A_T_out'
ApolloRTCCMFD: orbitersdk\samples\projectapollo\src_rtccmfd\csmlmguidancesim.cpp(833): error C2597: illegal reference to non-static member 'CSMLMPoweredFlightIntegration::DV_ul'
ApolloRTCCMFD: orbitersdk\samples\projectapollo\src_rtccmfd\csmlmguidancesim.cpp(834): error C2597: illegal reference to non-static member 'CSMLMPoweredFlightIntegration::WTENGON'
ApolloRTCCMFD: orbitersdk\samples\projectapollo\src_rtccmfd\csmlmguidancesim.cpp(837): error C2597: illegal reference to non-static member 'CSMLMPoweredFlightIntegration::VGN'
ApolloRTCCMFD: orbitersdk\samples\projectapollo\src_rtccmfd\csmlmguidancesim.cpp(840): error C2597: illegal reference to non-static member 'CSMLMPoweredFlightIntegration::DT'
ApolloRTCCMFD: orbitersdk\samples\projectapollo\src_rtccmfd\csmlmguidancesim.cpp(840): error C3867: 'CSMLMPoweredFlightIntegration::DT': non-standard syntax; use '&' to create a pointer to member
ApolloRTCCMFD: orbitersdk\samples\projectapollo\src_rtccmfd\csmlmguidancesim.cpp(846): error C2597: illegal reference to non-static member 'CSMLMPoweredFlightIntegration::TPREV'
ApolloRTCCMFD: orbitersdk\samples\projectapollo\src_rtccmfd\csmlmguidancesim.cpp(848): error C2597: illegal reference to non-static member 'CSMLMPoweredFlightIntegration::T'
ApolloRTCCMFD: orbitersdk\samples\projectapollo\src_rtccmfd\csmlmguidancesim.cpp(848): error C3867: 'CSMLMPoweredFlightIntegration::T': non-standard syntax; use '&' to create a pointer to member
ApolloRTCCMFD: orbitersdk\samples\projectapollo\src_rtccmfd\csmlmguidancesim.cpp(848): error C2597: illegal reference to non-static member 'CSMLMPoweredFlightIntegration::DT2'
ApolloRTCCMFD: orbitersdk\samples\projectapollo\src_rtccmfd\csmlmguidancesim.cpp(848): error C3867: 'CSMLMPoweredFlightIntegration::DT2': non-standard syntax; use '&' to create a pointer to member
ApolloRTCCMFD: orbitersdk\samples\projectapollo\src_rtccmfd\csmlmguidancesim.cpp(848): error C2568: '+': unable to resolve function overload
ApolloRTCCMFD: orbitersdk\samples\projectapollo\src_rtccmfd\csmlmguidancesim.cpp(850): error C2597: illegal reference to non-static member 'CSMLMPoweredFlightIntegration::RDD'
ApolloRTCCMFD: orbitersdk\samples\projectapollo\src_rtccmfd\csmlmguidancesim.cpp(853): error C2597: illegal reference to non-static member 'CSMLMPoweredFlightIntegration::DT4'
ApolloRTCCMFD: orbitersdk\samples\projectapollo\src_rtccmfd\csmlmguidancesim.cpp(854): error C2597: illegal reference to non-static member 'CSMLMPoweredFlightIntegration::DT2'
ApolloRTCCMFD: orbitersdk\samples\projectapollo\src_rtccmfd\csmlmguidancesim.cpp(855): error C2597: illegal reference to non-static member 'CSMLMPoweredFlightIntegration::KCODE'
ApolloRTCCMFD: orbitersdk\samples\projectapollo\src_rtccmfd\csmlmguidancesim.cpp(856): error C2352: 'CSMLMPoweredFlightIntegration::pCRDD': illegal call of non-static member function
ApolloRTCCMFD: orbitersdk\samples\projectapollo\src_rtccmfd\csmlmguidancesim.cpp(857): error C2597: illegal reference to non-static member 'CSMLMPoweredFlightIntegration::RDD'
ApolloRTCCMFD: orbitersdk\samples\projectapollo\src_rtccmfd\csmlmguidancesim.cpp(858): error C2597: illegal reference to non-static member 'CSMLMPoweredFlightIntegration::DT2'
ApolloRTCCMFD: orbitersdk\samples\projectapollo\src_rtccmfd\csmlmguidancesim.cpp(859): error C2597: illegal reference to non-static member 'CSMLMPoweredFlightIntegration::KCODE'
ApolloRTCCMFD: orbitersdk\samples\projectapollo\src_rtccmfd\csmlmguidancesim.cpp(860): error C2352: 'CSMLMPoweredFlightIntegration::pCRDD': illegal call of non-static member function
ApolloRTCCMFD: orbitersdk\samples\projectapollo\src_rtccmfd\csmlmguidancesim.cpp(861): error C2597: illegal reference to non-static member 'CSMLMPoweredFlightIntegration::T'
ApolloRTCCMFD: orbitersdk\samples\projectapollo\src_rtccmfd\csmlmguidancesim.cpp(862): error C2597: illegal reference to non-static member 'CSMLMPoweredFlightIntegration::RDD'
ApolloRTCCMFD: orbitersdk\samples\projectapollo\src_rtccmfd\csmlmguidancesim.cpp(863): error C2597: illegal reference to non-static member 'CSMLMPoweredFlightIntegration::DT2'
ApolloRTCCMFD: orbitersdk\samples\projectapollo\src_rtccmfd\csmlmguidancesim.cpp(864): error C2597: illegal reference to non-static member 'CSMLMPoweredFlightIntegration::DT'
ApolloRTCCMFD: orbitersdk\samples\projectapollo\src_rtccmfd\csmlmguidancesim.cpp(865): error C2597: illegal reference to non-static member 'CSMLMPoweredFlightIntegration::KCODE'
ApolloRTCCMFD: orbitersdk\samples\projectapollo\src_rtccmfd\csmlmguidancesim.cpp(866): error C2352: 'CSMLMPoweredFlightIntegration::pCRDD': illegal call of non-static member function
ApolloRTCCMFD: orbitersdk\samples\projectapollo\src_rtccmfd\csmlmguidancesim.cpp(868): error C2597: illegal reference to non-static member 'CSMLMPoweredFlightIntegration::DT6'
ApolloRTCCMFD: orbitersdk\samples\projectapollo\src_rtccmfd\csmlmguidancesim.cpp(869): error C2597: illegal reference to non-static member 'CSMLMPoweredFlightIntegration::RP'
ApolloRTCCMFD: orbitersdk\samples\projectapollo\src_rtccmfd\csmlmguidancesim.cpp(870): error C2597: illegal reference to non-static member 'CSMLMPoweredFlightIntegration::RDD'
ApolloRTCCMFD: orbitersdk\samples\projectapollo\src_rtccmfd\csmlmguidancesim.cpp(871): error C2597: illegal reference to non-static member 'CSMLMPoweredFlightIntegration::VP'
ApolloRTCCMFD: orbitersdk\samples\projectapollo\src_rtccmfd\csmlmguidancesim.cpp(875): error C2597: illegal reference to non-static member 'CSMLMPoweredFlightIntegration::T'
ApolloRTCCMFD: orbitersdk\samples\projectapollo\src_rtccmfd\csmlmguidancesim.cpp(875): error C3867: 'CSMLMPoweredFlightIntegration::T': non-standard syntax; use '&' to create a pointer to member
ApolloRTCCMFD: orbitersdk\samples\projectapollo\src_rtccmfd\csmlmguidancesim.cpp(875): error C2597: illegal reference to non-static member 'CSMLMPoweredFlightIntegration::TNEXT'
ApolloRTCCMFD: orbitersdk\samples\projectapollo\src_rtccmfd\csmlmguidancesim.cpp(875): error C3867: 'CSMLMPoweredFlightIntegration::TNEXT': non-standard syntax; use '&' to create a pointer to member
ApolloRTCCMFD: orbitersdk\samples\projectapollo\src_rtccmfd\csmlmguidancesim.cpp(875): error C2568: '==': unable to resolve function overload
ApolloRTCCMFD: orbitersdk\samples\projectapollo\src_rtccmfd\csmlmguidancesim.cpp(879): error C2597: illegal reference to non-static member 'CSMLMPoweredFlightIntegration::R'
ApolloRTCCMFD: orbitersdk\samples\projectapollo\src_rtccmfd\csmlmguidancesim.cpp(880): error C2597: illegal reference to non-static member 'CSMLMPoweredFlightIntegration::V'
ApolloRTCCMFD: orbitersdk\samples\projectapollo\src_rtccmfd\csmlmguidancesim.cpp(883): error C2039: 'table': is not a member of 'EphemerisDataTable'
ApolloRTCCMFD: orbitersdk\samples\projectapollo\src_rtccmfd\csmlmguidancesim.cpp(884): error C2597: illegal reference to non-static member 'CSMLMPoweredFlightIntegration::TLOP'
ApolloRTCCMFD: orbitersdk\samples\projectapollo\src_rtccmfd\csmlmguidancesim.cpp(888): error C2597: illegal reference to non-static member 'CSMLMPoweredFlightIntegration::WT'


-- Too many messages, post truncated --

---------- Post added at 01:07 PM ---------- Previous post was at 12:52 PM ----------

BRANCH: Orbiter2016
BUILD NUMBER: 1486
RELEASE LINK: https://github.com/dseagrav/NASSP/r...016-1486/NASSP-V8.0-Beta-Orbiter2016-1486.zip
COMMIT: [email protected] [d1dff8ff74] Attempt to fix build errors no. 2
BUILD STATUS: PASSED
BUILD START: 4/11/2020 12:55 PM
BUILD ENDED: 4/11/2020 1:07 PM
BUILD DURATION: 00:11:50.2704470
JOB: x5diu2hfstymbb1w
MESSAGES:

---------- Post added at 05:56 PM ---------- Previous post was at 01:07 PM ----------

BRANCH: Orbiter2016
BUILD NUMBER: 1487
RELEASE LINK: https://github.com/dseagrav/NASSP/r...016-1487/NASSP-V8.0-Beta-Orbiter2016-1487.zip
COMMIT: [email protected] [6a5b8f66de] Let mission file directory be included in the auto builds
BUILD STATUS: PASSED
BUILD START: 4/11/2020 5:44 PM
BUILD ENDED: 4/11/2020 5:56 PM
BUILD DURATION: 00:12:08.9430476
JOB: 7104r7my758md9fc
MESSAGES:
 

NASSP BuildBot

New member
Joined
May 27, 2018
Messages
113
Reaction score
0
Points
0
Location
Dallas
Website
www.lunar-tokyo.net
BRANCH Orbiter2016 BUILD 1488 PASSED

BRANCH: Orbiter2016
BUILD NUMBER: 1488
RELEASE LINK: https://github.com/dseagrav/NASSP/r...016-1488/NASSP-V8.0-Beta-Orbiter2016-1488.zip
COMMIT: [email protected] [ee6d568368] RTCC: Update calculations for predicted site acquisition tables; some fixes for moonrise/moonset and sunrise/sunset displays
BUILD STATUS: PASSED
BUILD START: 4/14/2020 2:12 PM
BUILD ENDED: 4/14/2020 2:32 PM
BUILD DURATION: 00:19:56.3679505
JOB: p4ivygy01y8vcp0s
MESSAGES:

ProjectApolloMFD: LINK(): warning LNK4098: defaultlib 'LIBCMT' conflicts with use of other libs; use /NODEFAULTLIB:library
ProjectApolloConfigurator: LINK(): warning LNK4098: defaultlib 'LIBCMT' conflicts with use of other libs; use /NODEFAULTLIB:library
ApolloRTCCMFD: LINK(): warning LNK4098: defaultlib 'LIBCMT' conflicts with use of other libs; use /NODEFAULTLIB:library

---------- Post added at 08:53 PM ---------- Previous post was at 02:32 PM ----------

BRANCH: Orbiter2016
BUILD NUMBER: 1489
RELEASE LINK: https://github.com/orbiternassp/NAS...016-1489/NASSP-V8.0-Beta-Orbiter2016-1489.zip
COMMIT: [email protected] [ee6d568368] RTCC: Update calculations for predicted site acquisition tables; some fixes for moonrise/moonset and sunrise/sunset displays
BUILD STATUS: PASSED
BUILD START: 4/14/2020 8:38 PM
BUILD ENDED: 4/14/2020 8:53 PM
BUILD DURATION: 00:14:50.7061500
JOB: pyt6wjt2dqot9wbo
MESSAGES:

ProjectApolloMFD: LINK(): warning LNK4098: defaultlib 'LIBCMT' conflicts with use of other libs; use /NODEFAULTLIB:library
ProjectApolloConfigurator: LINK(): warning LNK4098: defaultlib 'LIBCMT' conflicts with use of other libs; use /NODEFAULTLIB:library
ApolloRTCCMFD: LINK(): warning LNK4098: defaultlib 'LIBCMT' conflicts with use of other libs; use /NODEFAULTLIB:library

---------- Post added 04-15-20 at 01:43 PM ---------- Previous post was 04-14-20 at 08:53 PM ----------

BRANCH: Orbiter2016
BUILD NUMBER: 1490
RELEASE LINK: https://github.com/orbiternassp/NAS...016-1490/NASSP-V8.0-Beta-Orbiter2016-1490.zip
COMMIT: [email protected] [0626e38885] Begin of work on updated Return to Earth Processor
BUILD STATUS: PASSED
BUILD START: 4/15/2020 1:21 PM
BUILD ENDED: 4/15/2020 1:43 PM
BUILD DURATION: 00:22:11.9496800
JOB: uwrtxomx5a87ee5g
MESSAGES:

ApolloRTCCMFD: LINK(): warning LNK4098: defaultlib 'LIBCMT' conflicts with use of other libs; use /NODEFAULTLIB:library
ProjectApolloMFD: LINK(): warning LNK4098: defaultlib 'LIBCMT' conflicts with use of other libs; use /NODEFAULTLIB:library
ProjectApolloConfigurator: LINK(): warning LNK4098: defaultlib 'LIBCMT' conflicts with use of other libs; use /NODEFAULTLIB:library

---------- Post added at 03:29 PM ---------- Previous post was at 01:43 PM ----------

BRANCH: Orbiter2016
BUILD NUMBER: 1491
RELEASE LINK: https://github.com/orbiternassp/NAS...016-1491/NASSP-V8.0-Beta-Orbiter2016-1491.zip
COMMIT: [email protected] [37827f7468] Checklist fixes for https://github.com/orbiternassp/NASSP/issues/508
BUILD STATUS: PASSED
BUILD START: 4/15/2020 3:08 PM
BUILD ENDED: 4/15/2020 3:29 PM
BUILD DURATION: 00:21:21.7431737
JOB: 990sa4ubwk066oji
MESSAGES:

ProjectApolloMFD: LINK(): warning LNK4098: defaultlib 'LIBCMT' conflicts with use of other libs; use /NODEFAULTLIB:library
ProjectApolloConfigurator: LINK(): warning LNK4098: defaultlib 'LIBCMT' conflicts with use of other libs; use /NODEFAULTLIB:library
ApolloRTCCMFD: LINK(): warning LNK4098: defaultlib 'LIBCMT' conflicts with use of other libs; use /NODEFAULTLIB:library

---------- Post added at 04:45 PM ---------- Previous post was at 03:29 PM ----------

BRANCH: Orbiter2016
BUILD NUMBER: 1492
RELEASE LINK: https://github.com/orbiternassp/NAS...016-1492/NASSP-V8.0-Beta-Orbiter2016-1492.zip
COMMIT: [email protected] [7b3ac6ad6b] Merge pull request #516 from rcflyinghokie/Orbiter2016
BUILD STATUS: PASSED
BUILD START: 4/15/2020 4:23 PM
BUILD ENDED: 4/15/2020 4:45 PM
BUILD DURATION: 00:21:46.5526483
JOB: n9633yt516f9r4qk
MESSAGES:

ProjectApolloMFD: LINK(): warning LNK4098: defaultlib 'LIBCMT' conflicts with use of other libs; use /NODEFAULTLIB:library
ProjectApolloConfigurator: LINK(): warning LNK4098: defaultlib 'LIBCMT' conflicts with use of other libs; use /NODEFAULTLIB:library
ApolloRTCCMFD: LINK(): warning LNK4098: defaultlib 'LIBCMT' conflicts with use of other libs; use /NODEFAULTLIB:library
 

NASSP BuildBot

New member
Joined
May 27, 2018
Messages
113
Reaction score
0
Points
0
Location
Dallas
Website
www.lunar-tokyo.net
BRANCH Orbiter2016 BUILD 1493 PASSED

BRANCH: Orbiter2016
BUILD NUMBER: 1493
RELEASE LINK: https://github.com/orbiternassp/NAS...016-1493/NASSP-V8.0-Beta-Orbiter2016-1493.zip
COMMIT: [email protected] [d6405cf0df] Merge remote-tracking branch 'origin/Orbiter2016' into Orbiter2016
BUILD STATUS: PASSED
BUILD START: 4/16/2020 5:23 PM
BUILD ENDED: 4/16/2020 5:43 PM
BUILD DURATION: 00:19:34.8759497
JOB: v4g3v75y9uvrn2e0
MESSAGES:

ProjectApolloMFD: LINK(): warning LNK4098: defaultlib 'LIBCMT' conflicts with use of other libs; use /NODEFAULTLIB:library
ProjectApolloConfigurator: LINK(): warning LNK4098: defaultlib 'LIBCMT' conflicts with use of other libs; use /NODEFAULTLIB:library
ApolloRTCCMFD: LINK(): warning LNK4098: defaultlib 'LIBCMT' conflicts with use of other libs; use /NODEFAULTLIB:library

---------- Post added 04-17-20 at 03:28 PM ---------- Previous post was 04-16-20 at 05:43 PM ----------

BRANCH: Orbiter2016
BUILD NUMBER: 1494
RELEASE LINK: https://github.com/orbiternassp/NAS...016-1494/NASSP-V8.0-Beta-Orbiter2016-1494.zip
COMMIT: [email protected] [603fef7d61] Merge pull request #517 from rcflyinghokie/Orbiter2016
BUILD STATUS: PASSED
BUILD START: 4/17/2020 3:10 PM
BUILD ENDED: 4/17/2020 3:28 PM
BUILD DURATION: 00:17:43.7874148
JOB: we3pi1wy93khxqf2
MESSAGES:

ProjectApolloMFD: LINK(): warning LNK4098: defaultlib 'LIBCMT' conflicts with use of other libs; use /NODEFAULTLIB:library
ProjectApolloConfigurator: LINK(): warning LNK4098: defaultlib 'LIBCMT' conflicts with use of other libs; use /NODEFAULTLIB:library
ApolloRTCCMFD: LINK(): warning LNK4098: defaultlib 'LIBCMT' conflicts with use of other libs; use /NODEFAULTLIB:library
 

NASSP BuildBot

New member
Joined
May 27, 2018
Messages
113
Reaction score
0
Points
0
Location
Dallas
Website
www.lunar-tokyo.net
BRANCH Orbiter2016 BUILD 1495 PASSED

BRANCH: Orbiter2016
BUILD NUMBER: 1495
RELEASE LINK: https://github.com/orbiternassp/NAS...016-1495/NASSP-V8.0-Beta-Orbiter2016-1495.zip
COMMIT: [email protected] [62172f3d4d] RTCC: Rework MPT mass initialization
BUILD STATUS: PASSED
BUILD START: 4/19/2020 3:02 PM
BUILD ENDED: 4/19/2020 3:14 PM
BUILD DURATION: 00:11:36.5276386
JOB: 39xcfbw69ynjhljc
MESSAGES:

ProjectApolloMFD: LINK(): warning LNK4098: defaultlib 'LIBCMT' conflicts with use of other libs; use /NODEFAULTLIB:library
ProjectApolloConfigurator: LINK(): warning LNK4098: defaultlib 'LIBCMT' conflicts with use of other libs; use /NODEFAULTLIB:library
ApolloRTCCMFD: LINK(): warning LNK4098: defaultlib 'LIBCMT' conflicts with use of other libs; use /NODEFAULTLIB:library

---------- Post added at 05:46 PM ---------- Previous post was at 03:14 PM ----------

BRANCH: Orbiter2016
BUILD NUMBER: 1496
RELEASE LINK: https://github.com/orbiternassp/NAS...016-1496/NASSP-V8.0-Beta-Orbiter2016-1496.zip
COMMIT: [email protected] [753d2d6939] MCC: Fix bug in LOI-1 calculation
BUILD STATUS: PASSED
BUILD START: 4/19/2020 5:35 PM
BUILD ENDED: 4/19/2020 5:46 PM
BUILD DURATION: 00:11:45.0234789
JOB: 5m0a4n28nn239p91
MESSAGES:

ProjectApolloMFD: LINK(): warning LNK4098: defaultlib 'LIBCMT' conflicts with use of other libs; use /NODEFAULTLIB:library
ProjectApolloConfigurator: LINK(): warning LNK4098: defaultlib 'LIBCMT' conflicts with use of other libs; use /NODEFAULTLIB:library
ApolloRTCCMFD: LINK(): warning LNK4098: defaultlib 'LIBCMT' conflicts with use of other libs; use /NODEFAULTLIB:library

---------- Post added at 06:25 PM ---------- Previous post was at 05:46 PM ----------

BRANCH: Orbiter2016
BUILD NUMBER: 1497
RELEASE LINK: https://github.com/orbiternassp/NAS...016-1497/NASSP-V8.0-Beta-Orbiter2016-1497.zip
COMMIT: [email protected] [eb3c336878] RTCC: Fix bug in M50 MED (mass initialization)
BUILD STATUS: PASSED
BUILD START: 4/19/2020 6:14 PM
BUILD ENDED: 4/19/2020 6:25 PM
BUILD DURATION: 00:11:30.6761165
JOB: il3nnyhtqytjk06t
MESSAGES:

ProjectApolloMFD: LINK(): warning LNK4098: defaultlib 'LIBCMT' conflicts with use of other libs; use /NODEFAULTLIB:library
ProjectApolloConfigurator: LINK(): warning LNK4098: defaultlib 'LIBCMT' conflicts with use of other libs; use /NODEFAULTLIB:library
ApolloRTCCMFD: LINK(): warning LNK4098: defaultlib 'LIBCMT' conflicts with use of other libs; use /NODEFAULTLIB:library

---------- Post added at 09:14 PM ---------- Previous post was at 06:25 PM ----------

BRANCH: Orbiter2016
BUILD NUMBER: 1498
RELEASE LINK: https://github.com/orbiternassp/NAS...016-1498/NASSP-V8.0-Beta-Orbiter2016-1498.zip
COMMIT: [email protected] [f95ca4010f] RTCC MFD: Implement descent abort constants uplink for Apollo 12 and later
BUILD STATUS: PASSED
BUILD START: 4/19/2020 9:01 PM
BUILD ENDED: 4/19/2020 9:14 PM
BUILD DURATION: 00:13:17.1525966
JOB: 8yguhtues92xbn8u
MESSAGES:

ProjectApolloMFD: LINK(): warning LNK4098: defaultlib 'LIBCMT' conflicts with use of other libs; use /NODEFAULTLIB:library
ProjectApolloConfigurator: LINK(): warning LNK4098: defaultlib 'LIBCMT' conflicts with use of other libs; use /NODEFAULTLIB:library
ApolloRTCCMFD: LINK(): warning LNK4098: defaultlib 'LIBCMT' conflicts with use of other libs; use /NODEFAULTLIB:library

---------- Post added 04-20-20 at 03:25 PM ---------- Previous post was 04-19-20 at 09:14 PM ----------

BRANCH: Orbiter2016
BUILD NUMBER: 1499
RELEASE LINK: https://github.com/orbiternassp/NAS...016-1499/NASSP-V8.0-Beta-Orbiter2016-1499.zip
COMMIT: [email protected] [d985441c27] Fix Apollo 8 MCC bug in LOI-2 time estimation
BUILD STATUS: PASSED
BUILD START: 4/20/2020 3:06 PM
BUILD ENDED: 4/20/2020 3:25 PM
BUILD DURATION: 00:18:47.4177156
JOB: jjtss3thl2byotp8
MESSAGES:

ProjectApolloMFD: LINK(): warning LNK4098: defaultlib 'LIBCMT' conflicts with use of other libs; use /NODEFAULTLIB:library
ProjectApolloConfigurator: LINK(): warning LNK4098: defaultlib 'LIBCMT' conflicts with use of other libs; use /NODEFAULTLIB:library
ApolloRTCCMFD: LINK(): warning LNK4098: defaultlib 'LIBCMT' conflicts with use of other libs; use /NODEFAULTLIB:library

---------- Post added at 05:20 PM ---------- Previous post was at 03:25 PM ----------

BRANCH: Orbiter2016
BUILD NUMBER: 1500
RELEASE LINK: https://github.com/orbiternassp/NAS...016-1500/NASSP-V8.0-Beta-Orbiter2016-1500.zip
COMMIT: [email protected] [b0c244fb96] Merge pull request #518 from rcflyinghokie/Orbiter2016
BUILD STATUS: PASSED
BUILD START: 4/20/2020 4:57 PM
BUILD ENDED: 4/20/2020 5:20 PM
BUILD DURATION: 00:22:31.4745457
JOB: va4dlwjqq9eeu64l
MESSAGES:

ProjectApolloMFD: LINK(): warning LNK4098: defaultlib 'LIBCMT' conflicts with use of other libs; use /NODEFAULTLIB:library
ProjectApolloConfigurator: LINK(): warning LNK4098: defaultlib 'LIBCMT' conflicts with use of other libs; use /NODEFAULTLIB:library
ApolloRTCCMFD: LINK(): warning LNK4098: defaultlib 'LIBCMT' conflicts with use of other libs; use /NODEFAULTLIB:library

---------- Post added 04-21-20 at 01:24 PM ---------- Previous post was 04-20-20 at 05:20 PM ----------

BRANCH: Orbiter2016
BUILD NUMBER: 1501
RELEASE LINK: https://github.com/orbiternassp/NAS...016-1501/NASSP-V8.0-Beta-Orbiter2016-1501.zip
COMMIT: [email protected] [e92b397e72] RTCC: Implement optimum CSI mode; fix TLMCC maneuvers near sphere of influence crossing
BUILD STATUS: PASSED
BUILD START: 4/21/2020 1:06 PM
BUILD ENDED: 4/21/2020 1:24 PM
BUILD DURATION: 00:18:26.4382479
JOB: lhoe8uf905ma5vot
MESSAGES:

ProjectApolloMFD: LINK(): warning LNK4098: defaultlib 'LIBCMT' conflicts with use of other libs; use /NODEFAULTLIB:library
ProjectApolloConfigurator: LINK(): warning LNK4098: defaultlib 'LIBCMT' conflicts with use of other libs; use /NODEFAULTLIB:library
ApolloRTCCMFD: LINK(): warning LNK4098: defaultlib 'LIBCMT' conflicts with use of other libs; use /NODEFAULTLIB:library

---------- Post added at 06:50 PM ---------- Previous post was at 01:24 PM ----------

BRANCH: Orbiter2016
BUILD NUMBER: 1502
RELEASE LINK: https://github.com/orbiternassp/NAS...016-1502/NASSP-V8.0-Beta-Orbiter2016-1502.zip
COMMIT: [email protected] [582e45e479] Merge pull request #519 from jalexb88/Orbiter2016
BUILD STATUS: PASSED
BUILD START: 4/21/2020 6:37 PM
BUILD ENDED: 4/21/2020 6:50 PM
BUILD DURATION: 00:13:35.9784495
JOB: gqicr6tv5hx4jov5
MESSAGES:

ProjectApolloMFD: LINK(): warning LNK4098: defaultlib 'LIBCMT' conflicts with use of other libs; use /NODEFAULTLIB:library
ProjectApolloConfigurator: LINK(): warning LNK4098: defaultlib 'LIBCMT' conflicts with use of other libs; use /NODEFAULTLIB:library
ApolloRTCCMFD: LINK(): warning LNK4098: defaultlib 'LIBCMT' conflicts with use of other libs; use /NODEFAULTLIB:library

---------- Post added 04-22-20 at 04:49 PM ---------- Previous post was 04-21-20 at 06:50 PM ----------

BRANCH: Orbiter2016
BUILD NUMBER: 1503
RELEASE LINK: https://github.com/orbiternassp/NAS...016-1503/NASSP-V8.0-Beta-Orbiter2016-1503.zip
COMMIT: [email protected] [3ae1b3c444] Attempt to fix build warnings
BUILD STATUS: PASSED
BUILD START: 4/22/2020 4:29 PM
BUILD ENDED: 4/22/2020 4:49 PM
BUILD DURATION: 00:20:02.5414421
JOB: rcca66053gr7gamd
MESSAGES:
 

NASSP BuildBot

New member
Joined
May 27, 2018
Messages
113
Reaction score
0
Points
0
Location
Dallas
Website
www.lunar-tokyo.net
BRANCH Orbiter2016 BUILD 1504 PASSED

BRANCH: Orbiter2016
BUILD NUMBER: 1504
RELEASE LINK: https://github.com/orbiternassp/NAS...016-1504/NASSP-V8.0-Beta-Orbiter2016-1504.zip
COMMIT: [email protected] [71cc0050cb] Merge pull request #521 from n7275/CSM_Antennas
BUILD STATUS: PASSED
BUILD START: 4/26/2020 3:38 PM
BUILD ENDED: 4/26/2020 3:50 PM
BUILD DURATION: 00:11:27.2939451
JOB: h48gaq5vvkil8d6t
MESSAGES:

---------- Post added at 04:37 PM ---------- Previous post was at 03:50 PM ----------

BRANCH: Orbiter2016
BUILD NUMBER: 1505
RELEASE LINK: https://github.com/orbiternassp/NAS...016-1505/NASSP-V8.0-Beta-Orbiter2016-1505.zip
COMMIT: [email protected] [35b92bfcfa] More positions for the CSM HGA pitch and yaw switches
BUILD STATUS: PASSED
BUILD START: 4/26/2020 4:25 PM
BUILD ENDED: 4/26/2020 4:37 PM
BUILD DURATION: 00:12:04.7151527
JOB: i8hvevl15rwuho1a
MESSAGES:

---------- Post added at 06:22 PM ---------- Previous post was at 04:37 PM ----------

BRANCH: Orbiter2016
BUILD NUMBER: 1506
RELEASE LINK: https://github.com/orbiternassp/NAS...016-1506/NASSP-V8.0-Beta-Orbiter2016-1506.zip
COMMIT: [email protected] [90abdb7876] Some more plane change work, currently unused
BUILD STATUS: PASSED
BUILD START: 4/26/2020 6:10 PM
BUILD ENDED: 4/26/2020 6:22 PM
BUILD DURATION: 00:12:08.3422241
JOB: 8qh0c6xum7r46l63
MESSAGES:
 

NASSP BuildBot

New member
Joined
May 27, 2018
Messages
113
Reaction score
0
Points
0
Location
Dallas
Website
www.lunar-tokyo.net

NASSP BuildBot

New member
Joined
May 27, 2018
Messages
113
Reaction score
0
Points
0
Location
Dallas
Website
www.lunar-tokyo.net
BRANCH Orbiter2016 BUILD 1508 PASSED

BRANCH: Orbiter2016
BUILD NUMBER: 1508
RELEASE LINK: https://github.com/orbiternassp/NAS...016-1508/NASSP-V8.0-Beta-Orbiter2016-1508.zip
COMMIT: [email protected] [88c0ab109c] Merge pull request #522 from jalexb88/Orbiter2016
BUILD STATUS: PASSED
BUILD START: 5/3/2020 4:32 PM
BUILD ENDED: 5/3/2020 4:44 PM
BUILD DURATION: 00:12:14.1794934
JOB: 6nulgfghtpgmjh40
MESSAGES:

---------- Post added 05-04-20 at 12:54 PM ---------- Previous post was 05-03-20 at 04:44 PM ----------

BRANCH: Orbiter2016
BUILD NUMBER: 1510
RELEASE LINK: https://github.com/orbiternassp/NAS...016-1510/NASSP-V8.0-Beta-Orbiter2016-1510.zip
COMMIT: [email protected] [a1ff1fbbcd] Merge pull request #524 from jalexb88/Orbiter2016
BUILD STATUS: PASSED
BUILD START: 5/4/2020 12:38 PM
BUILD ENDED: 5/4/2020 12:54 PM
BUILD DURATION: 00:16:28.8640440
JOB: 7s3yytw809hn177r
MESSAGES:

---------- Post added at 01:12 PM ---------- Previous post was at 12:54 PM ----------

BRANCH: Orbiter2016
BUILD NUMBER: 1511
RELEASE LINK: https://github.com/orbiternassp/NAS...016-1511/NASSP-V8.0-Beta-Orbiter2016-1511.zip
COMMIT: [email protected] [da2451be44] Merge remote-tracking branch 'origin/Orbiter2016' into Orbiter2016
BUILD STATUS: PASSED
BUILD START: 5/4/2020 12:54 PM
BUILD ENDED: 5/4/2020 1:12 PM
BUILD DURATION: 00:17:18.3142089
JOB: y0g80isty4ytbuhu
MESSAGES:

---------- Post added at 04:09 PM ---------- Previous post was at 01:12 PM ----------

BRANCH: Orbiter2016
BUILD NUMBER: 1512
RELEASE LINK: https://github.com/orbiternassp/NAS...016-1512/NASSP-V8.0-Beta-Orbiter2016-1512.zip
COMMIT: [email protected] [e004cf3519] MCC: Make state vector uplinks for Apollo 11 use current time, not time tagged
BUILD STATUS: PASSED
BUILD START: 5/4/2020 3:50 PM
BUILD ENDED: 5/4/2020 4:09 PM
BUILD DURATION: 00:19:11.9984552
JOB: l30f9rxj74t1vlev
MESSAGES:
 

NASSP BuildBot

New member
Joined
May 27, 2018
Messages
113
Reaction score
0
Points
0
Location
Dallas
Website
www.lunar-tokyo.net

NASSP BuildBot

New member
Joined
May 27, 2018
Messages
113
Reaction score
0
Points
0
Location
Dallas
Website
www.lunar-tokyo.net

NASSP BuildBot

New member
Joined
May 27, 2018
Messages
113
Reaction score
0
Points
0
Location
Dallas
Website
www.lunar-tokyo.net
BRANCH Orbiter2016 BUILD 1515 PASSED

BRANCH: Orbiter2016
BUILD NUMBER: 1515
RELEASE LINK: https://github.com/orbiternassp/NAS...016-1515/NASSP-V8.0-Beta-Orbiter2016-1515.zip
COMMIT: [email protected] [4eb8b48457] Merge pull request #527 from n7275/Antennas
BUILD STATUS: PASSED
BUILD START: 5/10/2020 8:49 AM
BUILD ENDED: 5/10/2020 9:01 AM
BUILD DURATION: 00:11:31.0265065
JOB: 3n8x2a6fmfrhr0fe
MESSAGES:

---------- Post added at 01:26 PM ---------- Previous post was at 09:01 AM ----------

BRANCH: Orbiter2016
BUILD NUMBER: 1516
RELEASE LINK: https://github.com/orbiternassp/NAS...016-1516/NASSP-V8.0-Beta-Orbiter2016-1516.zip
COMMIT: [email protected] [7434ba20af] Merge branch 'LLWP' into Orbiter2016
BUILD STATUS: PASSED
BUILD START: 5/10/2020 1:14 PM
BUILD ENDED: 5/10/2020 1:26 PM
BUILD DURATION: 00:11:45.2036209
JOB: u30mx82dg2xb30fc
MESSAGES:

---------- Post added at 04:10 PM ---------- Previous post was at 01:26 PM ----------

BRANCH: Orbiter2016
BUILD NUMBER: 1517
COMMIT: [email protected] [96c8d7f651] Implement TPI time display on two impulse multiple solution display, used under special circumstances
BUILD STATUS: FAILED
BUILD START: 5/10/2020 4:01 PM
BUILD ENDED: 5/10/2020 4:10 PM
BUILD DURATION: 00:08:42.0997032
JOB: sheoblsb33dgmmvx
MESSAGES:

ApolloRTCCMFD: orbitersdk\samples\projectapollo\src_rtccmfd\apollomfdbuttons.cpp(1859): error C2039: 'menuCycleTIPlanNumber': is not a member of 'ApolloRTCCMFD'
ApolloRTCCMFD: orbitersdk\samples\projectapollo\src_rtccmfd\apollomfdbuttons.cpp(1859): error C2065: 'menuCycleTIPlanNumber': undeclared identifier

---------- Post added at 06:58 PM ---------- Previous post was at 04:10 PM ----------

BRANCH: Orbiter2016
BUILD NUMBER: 1518
RELEASE LINK: https://github.com/orbiternassp/NAS...016-1518/NASSP-V8.0-Beta-Orbiter2016-1518.zip
COMMIT: [email protected]eply.github.com [ac03cbeee9] Forgot to include file in last commit
BUILD STATUS: PASSED
BUILD START: 5/10/2020 6:46 PM
BUILD ENDED: 5/10/2020 6:58 PM
BUILD DURATION: 00:11:47.6081575
JOB: glrobc645619218x
MESSAGES:
 

NASSP BuildBot

New member
Joined
May 27, 2018
Messages
113
Reaction score
0
Points
0
Location
Dallas
Website
www.lunar-tokyo.net

NASSP BuildBot

New member
Joined
May 27, 2018
Messages
113
Reaction score
0
Points
0
Location
Dallas
Website
www.lunar-tokyo.net
BRANCH Orbiter2016 BUILD 1520 PASSED

BRANCH: Orbiter2016
BUILD NUMBER: 1520
RELEASE LINK: https://github.com/orbiternassp/NAS...016-1520/NASSP-V8.0-Beta-Orbiter2016-1520.zip
COMMIT: [email protected] [0668f02e51] Merge pull request #529 from Jordan-64/Orbiter2016
BUILD STATUS: PASSED
BUILD START: 5/19/2020 6:32 PM
BUILD ENDED: 5/19/2020 6:48 PM
BUILD DURATION: 00:15:24.1481884
JOB: q8xtu807i9cl8k9n
MESSAGES:

---------- Post added at 07:05 PM ---------- Previous post was at 06:48 PM ----------

BRANCH: Orbiter2016
BUILD NUMBER: 1521
RELEASE LINK: https://github.com/orbiternassp/NAS...016-1521/NASSP-V8.0-Beta-Orbiter2016-1521.zip
COMMIT: [email protected] [626bc99d47] Delete elevation modifications to LC-39A and B as they are not necessary for LV IMU alignment after all and interfere with the new ML and LC-39 meshes and textures
BUILD STATUS: PASSED
BUILD START: 5/19/2020 6:48 PM
BUILD ENDED: 5/19/2020 7:05 PM
BUILD DURATION: 00:17:13.6245132
JOB: 50p7xp3sibaw17y1
MESSAGES:
 

NASSP BuildBot

New member
Joined
May 27, 2018
Messages
113
Reaction score
0
Points
0
Location
Dallas
Website
www.lunar-tokyo.net
BRANCH Orbiter2016 BUILD 1522 PASSED

BRANCH: Orbiter2016
BUILD NUMBER: 1522
RELEASE LINK: https://github.com/orbiternassp/NAS...016-1522/NASSP-V8.0-Beta-Orbiter2016-1522.zip
COMMIT: [email protected] [98cc0e137e] Fix time acceleration restriction in the LVDC flight sequence program
BUILD STATUS: PASSED
BUILD START: 5/21/2020 6:36 PM
BUILD ENDED: 5/21/2020 6:49 PM
BUILD DURATION: 00:12:58.7601917
JOB: jm7gsu0rl2k94tut
MESSAGES:

---------- Post added 05-22-20 at 04:42 PM ---------- Previous post was 05-21-20 at 06:49 PM ----------

BRANCH: Orbiter2016
BUILD NUMBER: 1523
RELEASE LINK: https://github.com/orbiternassp/NAS...016-1523/NASSP-V8.0-Beta-Orbiter2016-1523.zip
COMMIT: [email protected] [9e0495691f] Merge pull request #530 from Jordan-64/Orbiter2016
BUILD STATUS: PASSED
BUILD START: 5/22/2020 4:27 PM
BUILD ENDED: 5/22/2020 4:42 PM
BUILD DURATION: 00:14:24.6740832
JOB: 1gdytxns0pg1adrl
MESSAGES:

---------- Post added at 04:55 PM ---------- Previous post was at 04:42 PM ----------

BRANCH: Orbiter2016
BUILD NUMBER: 1524
RELEASE LINK: https://github.com/orbiternassp/NAS...016-1524/NASSP-V8.0-Beta-Orbiter2016-1524.zip
COMMIT: [email protected] [21081d90ab] LC-39 scenarios with the right animation state for damper arm and SA-3
BUILD STATUS: PASSED
BUILD START: 5/22/2020 4:42 PM
BUILD ENDED: 5/22/2020 4:55 PM
BUILD DURATION: 00:13:09.2603708
JOB: x07fb38eufxgo6tn
MESSAGES:

---------- Post added at 06:45 PM ---------- Previous post was at 04:55 PM ----------

BRANCH: Orbiter2016
BUILD NUMBER: 1525
RELEASE LINK: https://github.com/orbiternassp/NAS...016-1525/NASSP-V8.0-Beta-Orbiter2016-1525.zip
COMMIT: [email protected] [d8aaae191b] Merge pull request #531 from jalexb88/LMVC
BUILD STATUS: PASSED
BUILD START: 5/22/2020 6:31 PM
BUILD ENDED: 5/22/2020 6:45 PM
BUILD DURATION: 00:14:25.6203359
JOB: s7vahwhdr40sg9kg
MESSAGES:

---------- Post added at 07:36 PM ---------- Previous post was at 06:45 PM ----------

BRANCH: Orbiter2016
BUILD NUMBER: 1526
RELEASE LINK: https://github.com/orbiternassp/NAS...016-1526/NASSP-V8.0-Beta-Orbiter2016-1526.zip
COMMIT: [email protected] [12c18d2d27] Merge pull request #532 from Jordan-64/Orbiter2016
BUILD STATUS: PASSED
BUILD START: 5/22/2020 7:24 PM
BUILD ENDED: 5/22/2020 7:36 PM
BUILD DURATION: 00:12:13.3899728
JOB: 2h7x5cw7ip5ufcy7
MESSAGES:

---------- Post added 05-23-20 at 03:31 PM ---------- Previous post was 05-22-20 at 07:36 PM ----------

BRANCH: Orbiter2016
BUILD NUMBER: 1527
RELEASE LINK: https://github.com/orbiternassp/NAS...016-1527/NASSP-V8.0-Beta-Orbiter2016-1527.zip
COMMIT: [email protected] [3ef3070c91] Implement tapemeter drive speed limit
BUILD STATUS: PASSED
BUILD START: 5/23/2020 3:19 PM
BUILD ENDED: 5/23/2020 3:31 PM
BUILD DURATION: 00:11:56.1043451
JOB: 4mj6tcw068lc5dh8
MESSAGES:

---------- Post added 05-24-20 at 10:33 AM ---------- Previous post was 05-23-20 at 03:31 PM ----------

BRANCH: Orbiter2016
BUILD NUMBER: 1528
RELEASE LINK: https://github.com/orbiternassp/NAS...016-1528/NASSP-V8.0-Beta-Orbiter2016-1528.zip
COMMIT: [email protected] [b7d3aa2d1b] Merge pull request #534 from n7275/Orbiter2016
BUILD STATUS: PASSED
BUILD START: 5/24/2020 10:21 AM
BUILD ENDED: 5/24/2020 10:32 AM
BUILD DURATION: 00:11:52.1436920
JOB: fuyvr31gm3s3klvb
MESSAGES:
 

NASSP BuildBot

New member
Joined
May 27, 2018
Messages
113
Reaction score
0
Points
0
Location
Dallas
Website
www.lunar-tokyo.net

NASSP BuildBot

New member
Joined
May 27, 2018
Messages
113
Reaction score
0
Points
0
Location
Dallas
Website
www.lunar-tokyo.net

NASSP BuildBot

New member
Joined
May 27, 2018
Messages
113
Reaction score
0
Points
0
Location
Dallas
Website
www.lunar-tokyo.net
BRANCH Orbiter2016 BUILD 1531 PASSED

BRANCH: Orbiter2016
BUILD NUMBER: 1531
RELEASE LINK: https://github.com/orbiternassp/NAS...016-1531/NASSP-V8.0-Beta-Orbiter2016-1531.zip
COMMIT: [email protected] [10bdeaf6bd] Merge pull request #536 from n7275/Orbiter2016
BUILD STATUS: PASSED
BUILD START: 6/7/2020 11:20 AM
BUILD ENDED: 6/7/2020 11:32 AM
BUILD DURATION: 00:12:12.0199053
JOB: bxn8h424e0elcgn0
MESSAGES:

---------- Post added at 02:27 PM ---------- Previous post was at 11:32 AM ----------

BRANCH: contrib-guidelines
BUILD NUMBER: 1532
COMMIT: [email protected] [10bdeaf6bd] Merge pull request #536 from n7275/Orbiter2016
BUILD STATUS: FAILED
BUILD START: 6/7/2020 2:26 PM
BUILD ENDED: 6/7/2020 2:26 PM
BUILD DURATION: 00:00:35.8187755
JOB: blsrdjo7bx27y6li
MESSAGES:

---------- Post added at 02:52 PM ---------- Previous post was at 02:27 PM ----------

BRANCH: contrib-guidelines
BUILD NUMBER: 1533
COMMIT: [email protected] [5a218b449e] Draft CONTRIBUTING guidelines
BUILD STATUS: FAILED
BUILD START: 6/7/2020 2:51 PM
BUILD ENDED: 6/7/2020 2:52 PM
BUILD DURATION: 00:00:36.2530626
JOB: 53ued84j9jna93a6
MESSAGES:
 

NASSP BuildBot

New member
Joined
May 27, 2018
Messages
113
Reaction score
0
Points
0
Location
Dallas
Website
www.lunar-tokyo.net

NASSP BuildBot

New member
Joined
May 27, 2018
Messages
113
Reaction score
0
Points
0
Location
Dallas
Website
www.lunar-tokyo.net

NASSP BuildBot

New member
Joined
May 27, 2018
Messages
113
Reaction score
0
Points
0
Location
Dallas
Website
www.lunar-tokyo.net

NASSP BuildBot

New member
Joined
May 27, 2018
Messages
113
Reaction score
0
Points
0
Location
Dallas
Website
www.lunar-tokyo.net
Status
Not open for further replies.
Top